{"text_format":"1","workbook":"xlsx","n_sheets":10,"sheets":["READ ME FIRST","Inputs","Results","Impact","Coverage Data","Country Data","Wastage Data","Program Costs","Product Data","Gavi co-financing"],"not_rendered":{"charts":5,"images":2,"macros":1,"external_links":0,"defined_names":2,"comments":0,"pivot_tables":0},"unopened":[],"bounds":{"document_bytes":16777216,"sheet_cells":100000,"rows_first":2000,"rows_last":500,"rows_between":2000,"halvings":0,"cell_chars":16384,"cell_head_chars":4096},"cells_cut":0,"cells_raw":0,"read":"whole","date_system":"1900"}

{"sheet":"READ ME FIRST","index":0,"n_rows":65,"n_cols":6,"rows_kept":65,"cut":false,"hidden":false,"merged":[[12,1,12,6],[4,1,4,6],[38,1,38,6],[17,1,18,1],[17,2,18,4],[18,5,18,6],[19,2,19,4],[28,2,28,6],[29,2,29,6],[30,2,30,6],[17,5,17,6],[19,5,19,6],[20,5,20,6],[27,2,27,6],[33,1,33,6],[20,1,21,1],[1,1,1,6],[2,1,2,6],[10,1,10,6],[6,1,6,6],[8,1,8,6],[21,5,21,6],[20,2,21,4],[23,1,23,6],[25,1,25,6],[52,2,52,4],[41,5,41,6],[35,1,35,6],[40,5,40,6],[41,1,42,1],[41,2,42,4],[40,2,40,4],[42,5,42,6],[14,2,14,4],[14,5,14,6],[15,2,15,4],[16,2,16,4],[15,5,15,6],[16,5,16,6],[64,2,64,6],[60,2,60,6],[57,1,57,6],[54,2,54,4],[47,5,47,6],[48,5,48,6],[53,5,53,6],[54,5,54,6],[49,5,49,6],[48,2,48,4],[53,2,53,4],[61,2,61,6],[62,2,62,6],[50,5,50,6],[55,2,55,4],[55,5,55,6],[63,2,63,6],[43,2,43,4],[43,5,43,6],[51,2,51,4],[51,5,51,6],[49,2,49,4],[46,5,46,6],[44,2,44,4],[45,2,45,4],[46,2,46,4],[47,2,47,4],[45,5,45,6],[59,2,59,6],[50,2,50,4],[52,5,52,6],[44,5,44,6]]}
[null,"MCV 5-Dose Vial Assessment Support Tool"]
[null,"For questions or support, contact Linksbridge's MCV 5-dose team: lena.stashko@linksbridge.com; sheldon.halsted@linksbridge.com; and/or maggie.archbold@linksbridge.com"]
[null,"Overview"]
[]
[null,"The MCV 5-dose assessment support tool is a simple model for assessing and comparing the programmatic, financial, and logistical trade-offs between 5-dose and 10-dose MCV vials. It aims to help country-level decision-makers compare products and estimate its impact on coverage, total systems cost, and cold chain requirements. The tool can be used by any country interested in comparing MCV 10-dose and 5-dose products. "]
[]
[null,"Disclaimer: The MCV 5-dose assessment support tool aims to inform vaccine product selection. Please note that there is limited data available on the impact of MCV 5-dose vials on wastage rates, coverage, and costs; adjust the inputs as needed to account for this uncertainty. This model is meant to provide insights into the potential impact of transitioning to 5-dose vials and should not replace detailed forecasting or operational and budget planning. "]
[]
[null,"User Guide"]
[]
[null,"Inputs"]
[]
[null,"In the Inputs worksheet, you can select your country to model for and which vaccines to compare, and can adjust assumptions around coverage, wastage, and costs."]
[]
[null,"Category","Description",null,null,"Sources"]
[null,"Country","• Lets you select the country being analyzed and autopopulates target population size\n• You can also ene",null,null,"UNPD 2022 Revision, birth cohort size in 2022, autopopulated for the country listed as the reference"]
[null,"Coverage","• Coverage is autopopulated based on WUENIC Coverage estimates for MCV1 and MCV2 in 2021\n• We modeled the intervention effect across different baseline MCV1 and MCV2 coverage rates\n• We applied the intervention effect (+ 4.9% for MCV1, + 3.5% for MCV2) to baseline coverage up to 82.1% for MCV1 and 43.0% for MCV2\n• Beyond the baseline coverage found in the Zambia study, we assumed diminishing returns, with eventually no intervention effect once baseline coverage reaches 95%\n• As baseline MCV coverage increases, the impact of switching to 5-dose vials on coverage decreases",null,null,"WUENIC 2022 data, coverage in 2021 autopopulated for the country listed as the reference"]
[null,"Wastage","• Given the uncertainty of the impact of 5-dose vials on wastage, and the various factors that influence wastage, this analysis allows you to select from two different sources for wastage assumptions:\n1) The WHO/UNICEF Measles and Measles-Rubella (MR) Vaccine Five-Dose Vial Presentations Facts Sheet 2021\n2) The results from the Zambia study (Krudwig et al., 2020)",null,null,"WHO/UNICEF wastage"]
[null,null,null,null,null,"Zambia coverage and wastage study"]
[null,"Program Costs","• The additional annual financial and economic costs per dose administered associated with switching from 10-dose to 5-dose vials\n• Additional costs take into account cold chain, transport, outreach, human resources, and wastage disposal costs\n• Data came from the Zambia study",null,null,"Zambia 5-dose vial coverage and wastage study"]
{"$rows_left_out":46}
{"sheet":"Inputs","index":1,"n_rows":37,"n_cols":9,"rows_kept":37,"cut":false,"hidden":false,"merged":[[6,8,6,9],[7,8,7,9],[5,8,5,9],[8,8,8,9],[9,8,9,9],[26,4,26,6],[11,1,11,6],[1,1,1,6],[24,1,24,6],[20,4,20,6],[21,4,21,6],[22,4,22,6],[2,1,2,6],[6,4,6,6],[7,4,7,6],[4,1,4,6],[16,4,16,6],[9,4,9,6],[8,4,8,6],[2,8,2,9],[39,1,39,9],[39,11,39,20],[36,8,36,9],[29,11,29,20],[31,11,31,20],[33,8,34,9],[35,8,35,9],[33,11,33,12],[29,1,29,9],[31,1,31,9],[27,4,27,6],[13,4,13,6],[14,4,14,6],[15,4,15,6],[18,1,18,6]]}
[null,"MCV 5-Dose Vial Assessment Support Tool - Inputs"]
[null,"For questions or support, contact Linksbridge's MCV 5-dose team: lena.stashko@linksbridge.com; sheldon.halsted@linksbridge.com; and/or maggie.archbold@linksbridge.com"]
[null,"STEP 1: IMMUNIZATION PROGRAM"]
[]
[null,"Country"]
[null,null,null,null,null,null,null,null,"Legend:"]
[null,"Select country >>>","Indonesia",null,"Country being analyzed",null,null,null,"REQUIRED: Select input from drop-down menu."]
[null,"Target population size",{"$f":"VLOOKUP($C$7,'Country Data'!$B$3:$E$196,4,FALSE)","v":4435250},null,"UNPD 2022 Revision, birth cohort size in 2022, autopopulated for the country listed as the reference",null,null,null,"Autopopulated data based on selected inputs or pre-populated data. These cells can be overwritten if you want to enter your own inputs. "]
[null,"Gavi co-financing status","Preparatory transition",null,"Country's Gavi co-financing status in the year being analyzed",null,null,null,"Inputs that have been manually entered are highlighted in yellow. "]
[null,"Country co-financing share",1,null,"The country's percent of vaccine price per dose or \"price fraction\" that they are responsible for. Non-Gavi countries should enter 100% for all years,",null,null,null,"WARNING: If you manually adjust an input cell, click the RESET button if you want to return to autopopulated data."]
[]
[null,"Coverage"]
[]
[null,"MCV1 coverage",{"$f":"VLOOKUP($C$7,'Country Data'!$B$3:$D$196,2,FALSE)","v":0.72},null,"WUENIC 2022 data, MCV1 coverage in 2021, autopopulated for the country listed as the reference"]
[null,"MCV2 coverage",{"$f":"VLOOKUP($C$7,'Country Data'!$B$3:$D$196,3,FALSE)","v":0.5},null,"WUENIC 2022 data, MCV2 coverage in 2021, autopopulated for the country listed as the reference"]
[null,"Increase in MCV1 coverage",{"$f":"_xlfn.IFNA(VLOOKUP($C$14,Table14[],2,FALSE),0)","v":4.9000000000000002E-2},null,"Expected increase in MCV1 coverage by switching to 5-dose vials"]
[null,"Increase in MCV2 coverage",{"$f":"_xlfn.IFNA(VLOOKUP(C$15,Table14[],3,FALSE),0)","v":3.0244999999999966E-2},null,"Expected increase in MCV2 coverage by switching to 5-dose vials"]
[]
[null,"Wastage"]
[]
{"$rows_left_out":18}
{"sheet":"Results","index":2,"n_rows":48,"n_cols":28,"rows_kept":48,"cut":false,"hidden":false,"merged":[[44,1,44,2],[39,1,39,2],[40,1,40,2],[41,1,41,2],[42,1,42,2],[43,1,43,2],[21,1,21,2],[28,1,30,1],[33,11,33,12],[33,14,33,15],[32,1,33,1],[29,11,29,12],[29,14,29,15],[30,11,30,12],[30,14,30,15],[7,1,7,2],[8,1,8,2],[9,1,9,2],[10,1,10,2],[11,1,11,2],[38,14,40,15],[39,8,39,9],[39,5,39,6],[38,8,38,9],[23,1,23,15],[38,5,38,6],[38,11,40,12],[25,5,25,6],[25,8,25,9],[25,11,27,12],[25,14,27,15],[26,1,26,2],[26,5,26,6],[26,8,26,9],[27,1,27,2],[47,1,47,15],[16,5,16,6],[6,8,6,9],[7,8,7,9],[16,8,16,9],[17,5,17,6],[17,8,17,9],[43,11,43,12],[43,14,43,15],[44,11,44,12],[44,14,44,15],[28,11,28,12],[28,14,28,15],[41,11,41,12],[41,14,41,15],[42,11,42,12],[42,14,42,15],[31,11,31,12],[31,14,31,15],[1,1,1,8],[10,11,10,12],[11,11,11,12],[9,14,9,15],[10,14,10,15],[11,14,11,15],[9,11,9,12],[2,1,2,15],[4,1,4,15],[6,5,6,6],[7,5,7,6],[6,11,8,12],[6,14,8,15],[14,1,14,15],[32,11,32,12],[32,14,32,15],[36,1,36,15],[21,11,21,12],[21,14,21,15],[19,11,19,12],[19,14,19,15],[20,11,20,12],[20,14,20,15],[16,11,18,12],[16,14,18,15],[17,1,17,2],[18,1,18,2],[19,1,19,2],[20,1,20,2]]}
[null,"MCV 5-Dose Vial Decision Support Tool - Results (annual)"]
[null,"For questions or support, contact Linksbridge's MCV 5-dose team: lena.stashko@linksbridge.com; sheldon.halsted@linksbridge.com; and/or maggie.archbold@linksbridge.com"]
[null,{"$f":"_xlfn.CONCAT(\"OUTPUTS: \",UPPER(Inputs!C7))","v":"OUTPUTS: INDONESIA"}]
[]
[null,"VACCINE DELIVERY"]
[]
[null,null,null,"CURRENT 10-DOSE VIAL PRODUCT",null,"OPTION 1\n(5-DOSE VIAL)",null,null,"OPTION 2\n(5-DOSE VIAL)",null,null,"Description",null,null,"Interpretation"]
[null,"Vaccine and presentation",null,{"$f":"Inputs!$C$35","v":"Measles, SII\n 10-dose vial"},null,{"$f":"Inputs!$E$35","v":"Measles, SII\n 5-dose vial"},null,null,{"$f":"Inputs!$G$35","v":"Measles, SII\n 5-dose vial"}]
[null,"Output and difference",null,"Output",null,"Output","Difference (5d minus 10d)",null,"Output","Difference (5d minus 10d)"]
[null,"Total required supply",null,{"$f":"(Inputs!$C$8*Inputs!$C$14*(1/(1-Inputs!$C$22)))+(Inputs!$C$8*Inputs!$C$15*(1/(1-Inputs!$C$22)))","v":7788980.8550453447},null,{"$f":"(Inputs!$C$8*(Inputs!$C$14+Inputs!$C$16)*(1/(1-Inputs!$C$23)))+(Inputs!$C$8*(Inputs!$C$15+Inputs!$C$17)*(1/(1-Inputs!$C$23)))","v":6874822.6989382003},{"$f":"F10-D10","v":-914158.15610714443},null,{"$f":"(Inputs!$C$8*(Inputs!$C$14+Inputs!$C$16)*(1/(1-Inputs!$C$23)))+(Inputs!$C$8*(Inputs!$C$15+Inputs!$C$17)*(1/(1-Inputs!$C$23)))","v":6874822.6989382003},{"$f":"I10-D10","v":-914158.15610714443},null,"The demand for MCV considering target population, number of doses, coverage, and wastage rates",null,null,{"$f":"(_xlfn.CONCAT(\"The total required supply will reduce by \",TEXT(ABS(D10-F10),\"###,###,###\"),\" doses annually, or by \",TEXT(ABS(((D10-F10)/D10)),\"0%\")))","v":"The total required supply will reduce by 914,158 doses annually, or by 12%"}]
[null,"Number of doses administered",null,{"$f":"(Inputs!$C$8*Inputs!$C$14)+(Inputs!$C$8*Inputs!$C$15)","v":5411005},null,{"$f":"(Inputs!$C$8*(Inputs!$C$14+Inputs!$C$16))+(Inputs!$C$8*(Inputs!$C$15+Inputs!$C$17))","v":5762476.3862500004},{"$f":"F11-D11","v":351471.38625000045},null,{"$f":"(Inputs!$C$8*(Inputs!$C$14+Inputs!$C$16))+(Inputs!$C$8*(Inputs!$C$15+Inputs!$C$17))","v":5762476.3862500004},{"$f":"I11-D11","v":351471.38625000045},null,"The number of doses administered to children, including both MCV1 and MCV2 doses",null,null,{"$f":"IF(F11-D11=0,\"Since baseline MCV1 and MCV2 coverage is greater than 95%, this analysis assumes no increase of coverage or the number of children vaccinated by switching to 5-dose vials\",(_xlfn.CONCAT(\"An additional \",TEXT(ABS(F11-D11),\"###,###,###\"),\" doses will be administered each year (including MCV1 and MCV2), which is an increase of \",TEXT(ABS(((D11-F11)/D11)),\"0%\"))))","v":"An additional 351,471 doses will be administered each year (including MCV1 and MCV2), which is an increase of 6%"}]
[null,"Number of doses wasted",null,{"$f":"D10-D11","v":2377975.8550453447},null,{"$f":"F10-F11","v":1112346.3126881998},{"$f":"F12-D12","v":-1265629.5423571449},null,{"$f":"I10-I11","v":1112346.3126881998},{"$f":"I12-D12","v":-1265629.5423571449},null,"The number of doses wasted out of the total required supply, based on wastage rates",null,null,{"$f":"(_xlfn.CONCAT(\"The number of doses wasted will \",IF(F12<D12,\"decrease \",\"increase \"),\"by approximately \",TEXT(ABS(F12-D12),\"###,###,###\"),\" doses, or by \",TEXT(ABS(((D12-F12)/D12)),\"0%\")))","v":"The number of doses wasted will decrease by approximately 1,265,630 doses, or by 53%"}]
[]
[]
[null,"TOTAL SYSTEMS COSTS (PER VACCINATED CHILD)"]
[]
[null,null,null,"CURRENT 10-DOSE VIAL PRODUCT",null,"OPTION 1\n(5-DOSE VIAL)",null,null,"OPTION 2\n(5-DOSE VIAL)",null,null,"Description",null,null,"Interpretation\n(All values are comparing Option 1 with 10-dose vial product)"]
[null,"Vaccine and presentation",null,{"$f":"Inputs!$C$35","v":"Measles, SII\n 10-dose vial"},null,{"$f":"Inputs!$E$35","v":"Measles, SII\n 5-dose vial"},null,null,{"$f":"Inputs!$G$35","v":"Measles, SII\n 5-dose vial"}]
[null,"Output and difference",null,"Output",null,"Output","Difference (5d minus 10d)",null,"Output","Difference (5d minus 10d)"]
[null,"Vaccine procurement price",null,{"$f":"Inputs!C36","v":0.42299999999999999},null,{"$f":"Inputs!E36","v":0.52200000000000002},{"$f":"F20-D20","v":9.9000000000000032E-2},null,{"$f":"Inputs!G36","v":0.52200000000000002},{"$f":"I20-D20","v":9.9000000000000032E-2},null,"The vaccine price per dose",null,null,{"$f":"_xlfn.CONCAT(\"Without adjusting for wastage, 5-dose vials are \",TEXT(ABS(F20-D20),\"$0.00\"),\"  more expensive than 10-dose vials\")","v":"Without adjusting for wastage, 5-dose vials are $0.10  more expensive than 10-dose vials"}]
{"$rows_left_out":29}
{"sheet":"Impact","index":3,"n_rows":41,"n_cols":4,"rows_kept":41,"cut":false,"hidden":false,"merged":[[39,3,39,14],[40,3,40,14],[31,1,31,14],[33,1,33,14],[34,1,34,14],[36,1,36,14],[37,1,37,14],[38,3,38,14],[30,1,30,14],[22,1,22,14],[24,1,24,14],[25,1,25,14],[27,1,27,14],[28,1,28,14],[17,1,17,14],[18,1,18,14],[19,1,19,14],[11,1,11,14],[12,1,12,14],[13,1,13,14],[14,1,14,14],[7,1,7,14],[8,1,8,14],[1,1,1,7],[2,1,2,14],[4,1,4,14],[5,1,5,14],[6,1,6,14]]}
[null,"MCV 5-Dose Vial Assessment Support Tool - Results (annual)"]
[null,"For questions or support, contact Linksbridge's MCV 5-dose team: lena.stashko@linksbridge.com; sheldon.halsted@linksbridge.com; and/or maggie.archbold@linksbridge.com"]
[null,{"$f":"_xlfn.CONCAT(\"Impact: \",UPPER(Inputs!$C$7))","v":"Impact: INDONESIA"}]
[]
[null,"VACCINE DELIVERY"]
[null,{"$f":"_xlfn.CONCAT(\"KEY TAKEAWAYS OF OPTION 1: Switching to 5-dose vials results in lower total required supply\",IF(Results!F11=Results!D11,\"\",\", more children vaccinated,\"),\" and fewer doses wasted than with 10-dose vials\")","v":"KEY TAKEAWAYS OF OPTION 1: Switching to 5-dose vials results in lower total required supply, more children vaccinated, and fewer doses wasted than with 10-dose vials"}]
[null,{"$f":"(_xlfn.CONCAT(\"The total required supply will reduce by \",TEXT(ABS(Results!D10-Results!F10),\"###,###,###\"),\" doses annually, or by \",TEXT(ABS(((Results!D10-Results!F10)/Results!D10)),\"0%\")))","v":"The total required supply will reduce by 914,158 doses annually, or by 12%"}]
[null,{"$f":"IF(Results!D11-Results!F11=0,\"Since baseline MCV1 and MCV2 coverage is greater than 95%, this analysis assumes no increase of coverage or the number of children vaccinated by switching to 5-dose vials\",(_xlfn.CONCAT(\"An additional \",TEXT(ABS(Results!D11-Results!F11),\"###,###,###\"),\" doses will be administered each year (including MCV1 and MCV2), which is an increase of \",TEXT(ABS(((Results!D11-Results!F11)/Results!D11)),\"0%\"))))","v":"An additional 351,471 doses will be administered each year (including MCV1 and MCV2), which is an increase of 6%"}]
[null,{"$f":"(_xlfn.CONCAT(\"The number of doses wasted will \",IF(Results!F12<Results!D12,\"decrease \",\"increase \"),\"by approximately \",TEXT(ABS(Results!F12-Results!D12),\"###,###,###\"),\" doses, or by \",TEXT(ABS(((Results!D12-Results!F12)/Results!D12)),\"0%\")))","v":"The number of doses wasted will decrease by approximately 1,265,630 doses, or by 53%"}]
[]
[]
[null,"TOTAL SYSTEMS COSTS"]
[null,{"$f":"_xlfn.CONCAT(\"KEY TAKEAWAYS OF OPTION 1: \",IF(Results!F21>Results!D21,\"After adjusting for wastage and coverage, the vaccine procurement cost is marginally higher for 5-dose vials\",\"After adjusting for wastage and coverage, the vaccine procurement cost is cheaper for 5-dose vials than for 10-dose vials\"),\". In addition to the vaccine procurement cost, \",Inputs!C7,\" should also take into account the incremental non-vaccine costs associated with switching to 5-dose vials. Costs associated with switching may be offset by a Gavi switch grant, if eligible.\")","v":"KEY TAKEAWAYS OF OPTION 1: After adjusting for wastage and coverage, the vaccine procurement cost is marginally higher for 5-dose vials. In addition to the vaccine procurement cost, Indonesia should also take into account the incremental non-vaccine costs associated with switching to 5-dose vials. Costs associated with switching may be offset by a Gavi switch grant, if eligible."}]
[null,{"$f":"(_xlfn.CONCAT(\"The total vaccine procurement costs for \",Inputs!C7,\" will be approximately \",TEXT(Results!F29,\"$###,###,###\"),\", which is \",IF(Results!F29>Results!D29,_xlfn.CONCAT(TEXT(ABS(Results!F29-Results!D29),\"$###,###,###\"),\" more\"),_xlfn.CONCAT(TEXT(ABS(Results!F29-Results!D29),\"$###,###,###\"),\" less\")),\" expensive for 5-dose vials than for 10-dose vials, taking into account potential co-financing\"))","v":"The total vaccine procurement costs for Indonesia will be approximately $3,588,657, which is $293,919 more expensive for 5-dose vials than for 10-dose vials, taking into account potential co-financing"}]
[null,{"$f":"(_xlfn.CONCAT(\"The total costs for \",Inputs!C7,\", also taking into account incremental non-vaccine costs for 5-dose vials, will be approximately \",TEXT(Results!F33,\"$###,###,###\"),\", which is \",IF(Results!F33>Results!D33,_xlfn.CONCAT(TEXT(ABS(Results!F33-Results!D33),\"$###,###,###\"),\" more\"),_xlfn.CONCAT(TEXT(ABS(Results!F33-Results!D33),\"$###,###,###\"),\" less\")),\" expensive for 5-dose vials than for 10-dose vials\"))","v":"The total costs for Indonesia, also taking into account incremental non-vaccine costs for 5-dose vials, will be approximately $4,222,530, which is $927,791 more expensive for 5-dose vials than for 10-dose vials"}]
[]
[]
[null,"COLD CHAIN REQUIREMENTS"]
[null,"KEY TAKEAWAYS OF OPTION 1: While 5-dose vials take up more cold chain space per dose, this is offset by the lower total required supply, and all health facilities in the Zambia study had sufficient cold chain space. The Zambia study found that the difference in total net storage requirement per fully immunized child, including the vaccine, was marginal."]
[null,{"$f":"(_xlfn.CONCAT(\"The total cold chain volume for \",Inputs!C7,\" will be approximately \",IF(Results!F44>Results!D44,_xlfn.CONCAT(TEXT(ABS(Results!F44-Results!D44),\"###,###,###\"),\" cm3 more\"),_xlfn.CONCAT(TEXT(ABS(Results!F44-Results!D44),\"###,###,###\"),\" cm3 less\")),\" for 5-dose vials than for 10-dose vials\"))","v":"The total cold chain volume for Indonesia will be approximately 18,506,319 cm3 more for 5-dose vials than for 10-dose vials"}]
{"$rows_left_out":22}
{"sheet":"Coverage Data","index":4,"n_rows":102,"n_cols":3,"rows_kept":102,"cut":false,"hidden":true,"merged":[]}
["Coverage Data"]
["Baseline coverage","MCV1 coverage increase","MCV2 coverage increase"]
[0.01,4.9000000000000002E-2,3.5000000000000003E-2]
[0.02,4.9000000000000002E-2,3.5000000000000003E-2]
[0.03,4.9000000000000002E-2,3.5000000000000003E-2]
[0.04,4.9000000000000002E-2,3.5000000000000003E-2]
[0.05,4.9000000000000002E-2,3.5000000000000003E-2]
[0.06,4.9000000000000002E-2,3.5000000000000003E-2]
[7.0000000000000007E-2,4.9000000000000002E-2,3.5000000000000003E-2]
[0.08,4.9000000000000002E-2,3.5000000000000003E-2]
[0.09,4.9000000000000002E-2,3.5000000000000003E-2]
[0.1,4.9000000000000002E-2,3.5000000000000003E-2]
[0.11,4.9000000000000002E-2,3.5000000000000003E-2]
[0.12,4.9000000000000002E-2,3.5000000000000003E-2]
[0.13,4.9000000000000002E-2,3.5000000000000003E-2]
[0.14000000000000001,4.9000000000000002E-2,3.5000000000000003E-2]
[0.15,4.9000000000000002E-2,3.5000000000000003E-2]
[0.16,4.9000000000000002E-2,3.5000000000000003E-2]
[0.17,4.9000000000000002E-2,3.5000000000000003E-2]
[0.18,4.9000000000000002E-2,3.5000000000000003E-2]
{"$rows_left_out":83}
{"sheet":"Country Data","index":5,"n_rows":196,"n_cols":5,"rows_kept":196,"cut":false,"hidden":true,"merged":[]}
["Country Data (coverage & birth cohort size)"]
["ISO_code","Country","MCV1 Coverage (2021)","MCV2 Coverage (2021)","Birth Cohort (2022)"]
["AFG","Afghanistan",0.63,0.44,1368682]
["ALB","Albania",0.87,0.92,28218.5]
["DZA","Algeria",0.8,0.77,946304.5]
["AND","Andorra",0.99,0.97,335.5]
["AGO","Angola",0.36,0.32,1275483.5]
["ATG","Antigua",0.85,0.76,1123.5]
["ARG","Argentina",0.81,0.79,627545]
["ARM","Armenia",0.94,0.94,34060]
["AUS","Australia",0.93,0.94,298603]
["AUT","Austria",0.95,0.88,84112.5]
["AZE","Azerbaijan",0.93,0.9,127570.5]
["BHS","Bahamas",0.82,0.82,4631]
["BHR","Bahrain",0.99,0.99,17818]
["BGD","Bangladesh",0.97,0.93,2957644]
["BRB","Barbados",0.77,0.7,3018]
["BLR","Belarus",0.98,0.98,88439]
["BEL","Belgium",0.96,0.85,116052]
["BLZ","Belize",0.79,0.77,7064.5]
{"$rows_left_out":177}
{"sheet":"Wastage Data","index":6,"n_rows":5,"n_cols":4,"rows_kept":5,"cut":false,"hidden":true,"merged":[]}
["Wastage Data"]
["Wastage","10-dose","5-dose","Comments"]
["WHO/UNICEF Fact Sheet",0.4,0.3,"Wastage assumptions from the WHO/UNICEF M and MR Vaccine Five-dose vial Presentations Facts Sheet"]
["Zambia Study",0.30530000000000002,0.1618,"Wastage results from the Zambia study"]
["Manually enter wastage assumptions","Manually enter","Manually enter","Enter your own wastage assumptions for the vial size shown"]

{"sheet":"Program Costs","index":7,"n_rows":4,"n_cols":3,"rows_kept":4,"cut":false,"hidden":true,"merged":[]}
["Program Costs"]
["Wastage","Incremental Non-Vaccine Cost","Comments"]
["Zambia Study",0.11,"The Zambia study found that the incremental economic and financial cost per 5-dose vial administered was $0.11 (excluding the cost of the vaccine). Additional costs take into account cold chain, transport, outreach, human resources, and wastage disposal costs. Data came from the DPCP Zambia report."]
["Manually enter program costs","Manually enter","Enter your own programmatic cost assumptions associated with switching to 5-dose vials. This is the incremental, non-vaccine costs per dose administered. Costs take into account things such as cold chain, transport, outreach, human resources, and wastage disposal costs. "]

{"sheet":"Product Data","index":8,"n_rows":11,"n_cols":3,"rows_kept":11,"cut":false,"hidden":true,"merged":[]}
["Product Data"]
["Vaccine","Price per dose (UNICEF, 2023)","Cold chain volume per dose (in cm3)"]
["Measles, SII\n 10-dose vial",0.42299999999999999,{"$f":"2.11+3.14","v":5.25}]
["Measles, Bio Farma\n 10-dose vial",0.27,{"$f":"3.3+2.53","v":5.83}]
["MR, SII\n 10-dose vial",0.873,{"$f":"2.1+3.14","v":5.24}]
["MR, Bio E\n 10-dose vial",0.79200000000000004,{"$f":"1.78+2.12","v":3.9000000000000004}]
["MMR, SII\n 10-dose vial",1.7090000000000001,{"$f":"SUM(2.109+3.1424)","v":5.2514000000000003}]
["Measles, SII\n 5-dose vial",0.52200000000000002,{"$f":"3.16+5.48","v":8.64}]
["MR, SII\n 5-dose vial",1.0900000000000001,{"$f":"3.16+5.49","v":8.65}]
["MR, BioE\n 5-dose vial",0.91800000000000004,{"$f":"2.67+3.25","v":5.92}]
["MMR, SII\n 5-dose vial",1.776,{"$f":"4.218+5.481","v":9.6989999999999998}]

{"sheet":"Gavi co-financing","index":9,"n_rows":6,"n_cols":1,"rows_kept":6,"cut":false,"hidden":true,"merged":[]}
["Gavi co-financing status"]
["Initial self-financing"]
["Preparatory transition"]
["Accelerated transition"]
["Gavi graduated"]
["Non-Gavi"]